Reaction Details
TargetAlpha-1A adrenergic receptor
LigandBDBM50027023
Substrate/Competitorn/a
Meas. Tech.ChEBML_33092
Ki 1600±n/a nM
Citation Saari, WSHalczenko, WKing, SWHuff, JRGuare, JPHunt, CARandall, WCAnderson, PSLotti, VJTaylor, DA Pyridinylpiperazines, a new class of selective alpha 2-adrenoceptor antagonists. J Med Chem26:1696-701 (1984) Alpha-1A adrenergic receptor
Name:Alpha-1A adrenergic receptor
Type:Enzyme Catalytic Domain
Mol. Mass.:51492.08
Organism:CALF
Description:adrenergic Alpha1 0 CALF
Residue:466
BDBM50027023
NameBDBM50027023
Synonyms:1-(3-Iodo-pyridin-2-yl)-piperazine | CHEMBL295764
TypeSmall organic molecule
Emp. Form.C9H12IN3
Mol. Mass.289.1162
SMILESIc1cccnc1N1CCNCC1