Reaction Details
TargetGag-Pol polyprotein
LigandBDBM50027110
Substrate/Competitorn/a
Meas. Tech.ChEBML_196792
IC50 17000±n/a nM
Citation Wu, RSWolpert-DeFilippes, MKQuinn, FR Quantitative structure--activity correlations of rifamycins as inhibitors of viral RNA-directed DNA polymerase and mammalian alpha and beta DNA polymerases. J Med Chem23:256-61 (1980) Gag-Pol polyprotein
Name:Gag-Pol polyprotein
Type:PROTEIN
Mol. Mass.:32733.90
Organism:Woolly monkey sarcoma virus
Description:ChEMBL_196792
Residue:294
BDBM50027110
NameBDBM50027110
Synonyms:26-formyl-2,15,17,29-tetrahydroxy-11-methoxy-3,7,12,14,16,18,22-heptamethyl-6,23-dioxo-8,30-dioxa-24-azatetracyclo[23.3.1.14,7.05,28]triaconta-1(28),2,4,9,19,21,25(29),26-octaen-13-yl acetate | CHEMBL87160
TypeSmall organic molecule
Emp. Form.C38H47NO12
Mol. Mass.709.7793
SMILESCOC1\C=C\OC2(C)Oc3c(C2=O)c2cc(C=O)c(NC(=O)\C(C)=C/C=C/C(C)C(O)C(C)C(O)C(C)C(OC(C)=O)C1C)c(O)c2c(O)c3C