Reaction Details
TargetDNA polymerase beta
LigandBDBM50027114
Substrate/Competitorn/a
Meas. Tech.ChEBML_50773
IC50 48000±n/a nM
Citation Wu, RSWolpert-DeFilippes, MKQuinn, FR Quantitative structure--activity correlations of rifamycins as inhibitors of viral RNA-directed DNA polymerase and mammalian alpha and beta DNA polymerases. J Med Chem23:256-61 (1980) DNA polymerase beta
Name:DNA polymerase beta
Type:PROTEIN
Mol. Mass.:38297.87
Organism:Mus musculus
Description:ChEMBL_50773
Residue:335
BDBM50027114
NameBDBM50027114
Synonyms:2,15,17,29-tetrahydroxy-11-methoxy-3,7,12,14,16,18,22-heptamethyl-26-N'-Methylene-N,N-dipentyl-hydrazine-6,23-dioxo-8,30-dioxa-24-azatetracyclo[23.3.1.14,7.05,28]triaconta-1(28),2,4,9,19,21,25(29),26-octaen-13-yl acetate CHEMBL264475
TypeSmall organic molecule
Emp. Form.C48H69N3O11
Mol. Mass.864.075
SMILESCCCCCN(CCCCC)\N=C\c1cc2c3C(=O)C4(C)Oc3c(C)c(O)c2c(O)c1NC(=O)\C(C)=C/C=C/C(C)C(O)C(C)C(O)C(C)C(OC(C)=O)C(C)C(OC)\C=C\O4