Reaction Details
TargetD(1A) dopamine receptor
LigandBDBM82247
Substrate/Competitorn/a
Meas. Tech.ChEMBL_58816 (CHEMBL668240)
Ki 0.741310±n/a nM
Citation Claudi, FDi Stefano, ANapolitani, FCingolani, GMGiorgioni, GFontenla, JAMontenegro, GYRivas, MERosa, EMichelotto, BOrlando, GBrunetti, L Binding and preliminary evaluation of 5-hydroxy- and 10-hydroxy-2,3, 12,12a-tetrahydro-1H-[1]benzoxepino[2,3,4-ij]isoquinolines as dopamine receptor ligands. J Med Chem43:599-608 (2000) 
 
D(1A) dopamine receptor
Name:D(1A) dopamine receptor
Type:Enzyme Catalytic Domain
Mol. Mass.:49429.75
Organism:RAT
Description:P18901
Residue:446
BDBM82247
NameBDBM82247
Synonyms:8-Chloro-3-methyl-5-phenyl-2,3,4,5-tetrahydro-1H-benzo[d]azepin-7-ol(SCH 23390) CHEMBL2158641 SCH 23388 SCH 23390 (R-enantiomer) | SCH 23390,R(+)
TypeSmall organic molecule
Emp. Form.C17H18ClNO
Mol. Mass.287.784
SMILESCN1CCc2cc(Cl)c(O)cc2[C@H](C1)c1ccccc1