Reaction Details
TargetAlpha-1A adrenergic receptor
LigandBDBM50473671
Substrate/Competitorn/a
Meas. Tech.ChEMBL_33262 (CHEMBL643542)
EC50 1.9±n/a nM
Citation Hodson, SJBishop, MJSpeake, JDNavas, FGarrison, DTBigham, ECSaussy, DLLiacos, JAIrving, PEGobel, MJSherman, BW 2-(Anilinomethyl)imidazolines as alpha1 adrenergic receptor agonists: the discovery of alpha1a subtype selective 2'-alkylsulfonyl-substituted analogues. J Med Chem45:2229-39 (2002) 
 
Alpha-1A adrenergic receptor
Name:Alpha-1A adrenergic receptor
Type:Cell-surface receptors
Mol. Mass.:51511.67
Organism:Homo sapiens (Human)
Description:P35348
Residue:466
BDBM50473671
NameBDBM50473671
Synonyms:CHEMBL71479
TypeSmall organic molecule
Emp. Form.C12H17N3O2S
Mol. Mass.267.347
SMILESCc1ccc(c(NCC2=NCCN2)c1)S(C)(=O)=O