Reaction Details
TargetAlpha-1A adrenergic receptor
LigandBDBM50473672
Substrate/Competitorn/a
Meas. Tech.ChEMBL_33262 (CHEMBL643542)
EC50 2.3±n/a nM
Citation Hodson, SJBishop, MJSpeake, JDNavas, FGarrison, DTBigham, ECSaussy, DLLiacos, JAIrving, PEGobel, MJSherman, BW 2-(Anilinomethyl)imidazolines as alpha1 adrenergic receptor agonists: the discovery of alpha1a subtype selective 2'-alkylsulfonyl-substituted analogues. J Med Chem45:2229-39 (2002) 
 
Alpha-1A adrenergic receptor
Name:Alpha-1A adrenergic receptor
Type:Cell-surface receptors
Mol. Mass.:51511.67
Organism:Homo sapiens (Human)
Description:P35348
Residue:466
BDBM50473672
NameBDBM50473672
Synonyms:CHEMBL72768
TypeSmall organic molecule
Emp. Form.C11H14FN3S
Mol. Mass.239.312
SMILESCSc1ccc(F)cc1NCC1=NCCN1