Reaction Details
TargetAlpha-1D adrenergic receptor
LigandBDBM50473669
Substrate/Competitorn/a
Meas. Tech.ChEMBL_32576 (CHEMBL643414)
EC50 34±n/a nM
Citation Hodson, SJBishop, MJSpeake, JDNavas, FGarrison, DTBigham, ECSaussy, DLLiacos, JAIrving, PEGobel, MJSherman, BW 2-(Anilinomethyl)imidazolines as alpha1 adrenergic receptor agonists: the discovery of alpha1a subtype selective 2'-alkylsulfonyl-substituted analogues. J Med Chem45:2229-39 (2002) 
 
Alpha-1D adrenergic receptor
Name:Alpha-1D adrenergic receptor
Type:Enzyme Catalytic Domain
Mol. Mass.:60485.82
Organism:Homo sapiens (Human)
Description:adrenergic Alpha1D ADRA1D HUMAN::P25100
Residue:572
BDBM50473669
NameBDBM50473669
Synonyms:CHEMBL70692
TypeSmall organic molecule
Emp. Form.C11H14FN3S
Mol. Mass.239.312
SMILESCSc1c(F)cccc1NCC1=NCCN1