Reaction Details
TargetAlpha-1A adrenergic receptor
LigandBDBM50473665
Substrate/Competitorn/a
Meas. Tech.ChEMBL_33262 (CHEMBL643542)
EC50 0.436516±n/a nM
Citation Hodson, SJBishop, MJSpeake, JDNavas, FGarrison, DTBigham, ECSaussy, DLLiacos, JAIrving, PEGobel, MJSherman, BW 2-(Anilinomethyl)imidazolines as alpha1 adrenergic receptor agonists: the discovery of alpha1a subtype selective 2'-alkylsulfonyl-substituted analogues. J Med Chem45:2229-39 (2002) 
 
Alpha-1A adrenergic receptor
Name:Alpha-1A adrenergic receptor
Type:Cell-surface receptors
Mol. Mass.:51511.67
Organism:Homo sapiens (Human)
Description:P35348
Residue:466
BDBM50473665
NameBDBM50473665
Synonyms:CHEMBL70751
TypeSmall organic molecule
Emp. Form.C11H14ClN3S
Mol. Mass.255.767
SMILESCSc1ccc(Cl)cc1NCC1=NCCN1