Reaction Details
TargetThymidine kinase, cytosolic
LigandBDBM50027352
Substrate/Competitorn/a
Meas. Tech.ChEBML_207844
Ki 160000±n/a nM
Citation Schroeder, ACBardos, TJCheng, YC Synthesis and antiviral activity of 1-(2-deoxy-beta-D-ribofuranosyl)-5-(methylmercapto)-2-pyrimidinone. J Med Chem24:109-12 (1981) Thymidine kinase, cytosolic
Name:Thymidine kinase, cytosolic
Type:PROTEIN
Mol. Mass.:25476.50
Organism:Homo sapiens (Human)
Description:ChEMBL_1333884
Residue:234
BDBM50027352
NameBDBM50027352
Synonyms:1-(4,5-Dihydroxy-tetrahydro-furan-2-yl)-5-methylsulfanyl-1H-pyrimidin-2-one | CHEMBL268232
TypeSmall organic molecule
Emp. Form.C9H12N2O4S
Mol. Mass.244.268
SMILESCSc1cnc(=O)n(c1)C1CC(O)C(O)O1