Reaction Details
Target5-hydroxytryptamine receptor 7
LigandBDBM50240359
Substrate/Competitorn/a
Meas. Tech.ChEMBL_3768 (CHEMBL620767)
Ki 79±n/a nM
Citation López-Rodríguez, MLPorras, EMorcillo, MJBenhamú, BSoto, LJLavandera, JLRamos, JAOlivella, MCampillo, MPardo, L Optimization of the pharmacophore model for 5-HT7R antagonism. Design and synthesis of new naphtholactam and naphthosultam derivatives. J Med Chem46:5638-50 (2003) 
 
5-hydroxytryptamine receptor 7
Name:5-hydroxytryptamine receptor 7
Type:G Protein-Coupled Receptor (GPCR)
Mol. Mass.:49852.62
Organism:Rattus norvegicus (rat)
Description:Rat cloned 5-HT7R.
Residue:448
BDBM50240359
NameBDBM50240359
Synonyms:1-(5-(4-phenylpiperazin-1-yl)pentyl)benzo[cd]indol-2(1H)-one CHEMBL12259 | UCM-5600
TypeSmall organic molecule
Emp. Form.C26H29N3O
Mol. Mass.399.528
SMILESO=C1N(CCCCCN2CCN(CC2)c2ccccc2)c2cccc3cccc1c23