Reaction Details
Target5-hydroxytryptamine receptor 1D
LigandBDBM50475186
Substrate/Competitorn/a
Meas. Tech.ChEMBL_304073 (CHEMBL838507)
Ki 0.251189±n/a nM
Citation Ward, SEHarrington, FPGordon, LJHopley, SCScott, CMWatson, JM Discovery of the first potent, selective 5-hydroxytryptamine1D receptor antagonist. J Med Chem48:3478-80 (2005) 
 
5-hydroxytryptamine receptor 1D
Name:5-hydroxytryptamine receptor 1D
Type:G Protein-Coupled Receptor (GPCR)
Mol. Mass.:41920.63
Organism:Homo sapiens (Human)
Description:Receptor binding assays were performed using human clone stably expressed in CHO cells.
Residue:377
BDBM50475186
NameBDBM50475186
Synonyms:CHEMBL190298
TypeSmall organic molecule
Emp. Form.C24H27N5O
Mol. Mass.401.5041
SMILESCc1ccc2c(OCCN3CCN(Cc4cccc5[nH]cnc45)CC3)cccc2n1