Reaction Details
TargetAndrogen receptor
LigandBDBM18700
Substrate/Competitorn/a
Meas. Tech.ChEMBL_304043 (CHEMBL877110)
Ki 2.8±n/a nM
Citation Söderholm, AALehtovuori, PTNyrönen, TH Three-dimensional structure-activity relationships of nonsteroidal ligands in complex with androgen receptor ligand-binding domain. J Med Chem48:917-25 (2005) 
 
Androgen receptor
Name:Androgen receptor
Type:Enzyme
Mol. Mass.:98219.08
Organism:Rattus norvegicus (Rat)
Description:P15207
Residue:902
BDBM18700
NameBDBM18700
Synonyms:(2R)-N-[4-cyano-3-(trifluoromethyl)phenyl]-2-hydroxy-3-iodo-2-methylpropanamide | R-4
TypeSmall organic molecule
Emp. Form.C12H10F3IN2O2
Mol. Mass.398.1197
SMILESC[C@](O)(CI)C(=O)Nc1ccc(C#N)c(c1)C(F)(F)F