Reaction Details
TargetAndrogen receptor
LigandBDBM18697
Substrate/Competitorn/a
Meas. Tech.ChEMBL_304043 (CHEMBL877110)
Ki 200±n/a nM
Citation Söderholm, AALehtovuori, PTNyrönen, TH Three-dimensional structure-activity relationships of nonsteroidal ligands in complex with androgen receptor ligand-binding domain. J Med Chem48:917-25 (2005) 
 
Androgen receptor
Name:Androgen receptor
Type:Enzyme
Mol. Mass.:98219.08
Organism:Rattus norvegicus (Rat)
Description:P15207
Residue:902
BDBM18697
NameBDBM18697
Synonyms:(2S)-3-{[4-(2-chloroacetamido)phenyl]sulfanyl}-N-[4-cyano-3-(trifluoromethyl)phenyl]-2-hydroxy-2-methylpropanamide | Bicalutamide Analogue, (S)-11
TypeSmall organic molecule
Emp. Form.C20H17ClF3N3O3S
Mol. Mass.471.88
SMILESC[C@@](O)(CSc1ccc(NC(=O)CCl)cc1)C(=O)Nc1ccc(C#N)c(c1)C(F)(F)F