Reaction Details
TargetTyrosine-protein phosphatase non-receptor type 1
LigandBDBM50118744
Substrate/Competitorn/a
Meas. Tech.ChEMBL_326974 (CHEMBL859775)
Ki 13900±n/a nM
Citation Zhou, MJi, M Molecular docking and 3D-QSAR on 2-(oxalylamino) benzoic acid and its analogues as protein tyrosine phosphatase 1B inhibitors. Bioorg Med Chem Lett15:5521-5 (2005) 
 
Tyrosine-protein phosphatase non-receptor type 1
Name:Tyrosine-protein phosphatase non-receptor type 1
Type:Protein phosphatase
Mol. Mass.:49963.76
Organism:Homo sapiens (Human)
Description:Human recombinant GST-fusion PTP1B (1-435).
Residue:435
BDBM50118744
NameBDBM50118744
Synonyms:2-(Oxalyl-amino)-4,7-dihydro-5H-thieno[2,3-c]pyran-3-carboxylic acid CHEMBL138806
TypeSmall organic molecule
Emp. Form.C10H9NO6S
Mol. Mass.271.247
SMILESOC(=O)C(=O)Nc1sc2COCCc2c1C(O)=O