Reaction Details
TargetVoltage-dependent L-type calcium channel subunit alpha-1C
LigandBDBM50475854
Substrate/Competitorn/a
Meas. Tech.ChEMBL_385287 (CHEMBL869182)
Ki 3020±n/a nM
Citation Carosati, ECruciani, GChiarini, ABudriesi, RIoan, PSpisani, RSpinelli, DCosimelli, BFusi, FFrosini, MMatucci, RGasparrini, FCiogli, AStephens, PJDevlin, FJ Calcium channel antagonists discovered by a multidisciplinary approach. J Med Chem49:5206-16 (2006) 
 
Voltage-dependent L-type calcium channel subunit alpha-1C
Name:Voltage-dependent L-type calcium channel subunit alpha-1C
Type:Enzyme Catalytic Domain
Mol. Mass.:243492.26
Organism:RAT
Description:Calcium channel 0 RAT::P22002
Residue:2169
BDBM50475854
NameBDBM50475854
Synonyms:CHEMBL386435
TypeSmall organic molecule
Emp. Form.C14H19ClN2O2S
Mol. Mass.314.831
SMILESClc1ccc(cc1)S(=O)(=O)N(C1CC1)C1CCNCC1