Reaction Details
TargetAlpha-2B adrenergic receptor
LigandBDBM50029051
Substrate/Competitorn/a
Meas. Tech.ChEMBL_429546 (CHEMBL918087)
EC50 62±n/a nM
Citation Gentili, FGhelfi, FGiannella, MPiergentili, APigini, MQuaglia, WVesprini, CCrassous, PAParis, HCarrieri, A alpha 2-adrenoreceptors profile modulation. 2. Biphenyline analogues as tools for selective activation of the alpha 2C-subtype. J Med Chem47:6160-73 (2004) 
 
Alpha-2B adrenergic receptor
Name:Alpha-2B adrenergic receptor
Type:Enzyme
Mol. Mass.:49964.20
Organism:Homo sapiens (Human)
Description:P18089
Residue:450
BDBM50029051
NameBDBM50029051
Synonyms:(-)-arterenol (-)-norepinephrine (R)-4-(2-amino-1-hydroxyethyl)-1,2-benzenediol (R)-norepinephrine CHEMBL1437 | NOREPINEPHRINE
TypeSmall organic molecule
Emp. Form.C8H11NO3
Mol. Mass.169.1778
SMILESNC[C@H](O)c1ccc(O)c(O)c1