Reaction Details
TargetMuscarinic acetylcholine receptor M1/M2/M3/M4/M5
LigandBDBM50028051
Substrate/Competitorn/a
Meas. Tech.ChEMBL_138647 (CHEMBL749276)
Kd 25000±n/a nM
Citation Kalir, ATeomy, SAmir, AFuchs, PLee, SAHolsztynska, EJRocki, WDomino, EF N-allyl analogues of phencyclidine: chemical synthesis and pharmacological properties. J Med Chem27:1267-71 (1984) Muscarinic acetylcholine receptor M1/M2/M3/M4/M5
Name:Muscarinic acetylcholine receptor M1/M2/M3/M4/M5
Synonyms:Muscarinic acetylcholine receptor
Type:n/a
Mol. Mass.:n/a
Description:ASSAY_ID of ChEMBL is 138646
Components:This complex has 5 components.
Component 1
Name:Muscarinic acetylcholine receptor M2
Type:PROTEIN
Mol. Mass.:51515.43
Organism:Mus musculus
Description:ChEMBL_139897
Residue:466
Component 2
Name:Muscarinic acetylcholine receptor M5
Synonyms:ACM5_MOUSE Muscarinic acetylcholine receptor | Muscarinic acetylcholine receptor M5
Type:PROTEIN
Mol. Mass.:60282.66
Organism:Mus musculus
Description:ChEMBL_104873
Residue:532
Component 3
Name:Muscarinic acetylcholine receptor M4
Synonyms:ACM4_MOUSE Chrm-4 Mm4 mAChR | Muscarinic acetylcholine receptor
Type:Enzyme Catalytic Domain
Mol. Mass.:53004.88
Organism:MOUSE
Description:Cholinergic, muscarinic M4 CHRM4 MOUSE::P32211
Residue:479
Component 4
Name:Muscarinic acetylcholine receptor M3
Synonyms:ACM3_MOUSE Chrm3 Muscarinic acetylcholine receptor | Muscarinic acetylcholine receptor M3
Type:PROTEIN
Mol. Mass.:66232.94
Organism:Mus musculus
Description:ChEMBL_138834
Residue:589
Component 5
Name:Muscarinic acetylcholine receptor M1
Synonyms:ACM1_MOUSE Cholinergic, muscarinic Chrm1 Muscarinic acetylcholine receptor M1
Type:Enzyme Catalytic Domain
Mol. Mass.:51400.50
Organism:Mus musculus
Description:Cholinergic, muscarinic 0 0::Q52KQ0
Residue:460
BDBM50028051
NameBDBM50028051
Synonyms:CHEMBL23626 | Diallyl-(1-phenyl-cyclohexyl)-amine
TypeSmall organic molecule
Emp. Form.C18H25N
Mol. Mass.255.3978
SMILESC=CCN(CC=C)C1(CCCCC1)c1ccccc1