Reaction Details
TargetCholinesterase
LigandBDBM50028054
Substrate/Competitorn/a
Meas. Tech.ChEBML_41572
Ki 27000±n/a nM
Citation Kalir, ATeomy, SAmir, AFuchs, PLee, SAHolsztynska, EJRocki, WDomino, EF N-allyl analogues of phencyclidine: chemical synthesis and pharmacological properties. J Med Chem27:1267-71 (1984) Cholinesterase
Name:Cholinesterase
Type:Protein
Mol. Mass.:68465.99
Organism:Mus musculus (Mouse)
Description:Q03311
Residue:603
BDBM50028054
NameBDBM50028054
Synonyms:Allyl-(1-phenyl-cyclohexyl)-amine | CHEMBL281855
TypeSmall organic molecule
Emp. Form.C15H21N
Mol. Mass.215.3339
SMILESC=CCNC1(CCCCC1)c1ccccc1