Reaction Details
TargetMelatonin receptor type 1B
LigandBDBM50477319
Substrate/Competitorn/a
Meas. Tech.ChEMBL_452761 (CHEMBL903004)
Ki 0.027542±n/a nM
Citation Rivara, SLodola, AMor, MBedini, ASpadoni, GLucini, VPannacci, MFraschini, FScaglione, FSanchez, ROGobbi, GTarzia, G N-(substituted-anilinoethyl)amides: design, synthesis, and pharmacological characterization of a new class of melatonin receptor ligands. J Med Chem50:6618-26 (2007) 
 
Melatonin receptor type 1B
Name:Melatonin receptor type 1B
Type:Enzyme
Mol. Mass.:40203.54
Organism:Homo sapiens (Human)
Description:P49286
Residue:362
BDBM50477319
NameBDBM50477319
Synonyms:CHEMBL394273
TypeSmall organic molecule
Emp. Form.C18H22N2O3
Mol. Mass.314.3789
SMILESCOc1cccc(c1)N(CCNC(C)=O)c1cccc(OC)c1