Reaction Details
TargetcGMP-dependent 3',5'-cyclic phosphodiesterase
LigandBDBM50028192
Substrate/Competitorn/a
Meas. Tech.ChEBML_217498
Ki 700000±n/a nM
Citation Selvig, KRuud-Christensen, MAasen, AJ Optical resolution, absolute configuration, and activity of the enantiomers of proxyphylline. J Med Chem26:1514-8 (1983) cGMP-dependent 3',5'-cyclic phosphodiesterase
Name:cGMP-dependent 3',5'-cyclic phosphodiesterase
Type:Enzyme Catalytic Domain
Mol. Mass.:105691.58
Organism:Homo sapiens (Human)
Description:O00408
Residue:941
BDBM50028192
NameBDBM50028192
Synonyms:(S)-7-(2-hydroxypropyl)-1,3-dimethyl-1H-purine-2,6(3H,7H)-dione CHEMBL290644
TypeSmall organic molecule
Emp. Form.C10H14N4O3
Mol. Mass.238.2432
SMILESC[C@H](O)Cn1cnc2n(C)c(=O)n(C)c(=O)c12