Reaction Details
TargetMuscarinic acetylcholine receptor M1
LigandBDBM46858
Substrate/Competitorn/a
Meas. Tech.ChEMBL_470966 (CHEMBL923035)
Ki 29512±n/a nM
Citation Vistoli, GPedretti, ADei, SScapecchi, SMarconi, CRomanelli, MN Docking analyses on human muscarinic receptors: unveiling the subtypes peculiarities in agonists binding. Bioorg Med Chem16:3049-58 (2008) 
 
Muscarinic acetylcholine receptor M1
Name:Muscarinic acetylcholine receptor M1
Type:Protein
Mol. Mass.:51442.54
Organism:Homo sapiens (Human)
Description:P11229
Residue:460
BDBM46858
NameBDBM46858
Synonyms:1-methyl-3,6-dihydro-2H-pyridine-5-carboxylic acid methyl ester;hydrobromide ARECOLINE HYDROBROMIDE SMR000058258 cid_9301 | methyl 1-methyl-3,6-dihydro-2H-pyridine-5-carboxylate;hydrobromide
TypeSmall organic molecule
Emp. Form.C8H13NO2
Mol. Mass.155.1943
SMILESCOC(=O)C1=CCCN(C)C1