Reaction Details
TargetProtease
LigandBDBM50067593
Substrate/Competitorn/a
Meas. Tech.ChEMBL_491043 (CHEMBL982903)
Ki 0.120000±n/a nM
Citation Kozísek, MCígler, PLepsík, MFanfrlík, JRezácová, PBrynda, JPokorná, JPlesek, JGrüner, BGrantz Sasková, KVáclavíková, JKrál, VKonvalinka, J Inorganic polyhedral metallacarborane inhibitors of HIV protease: a new approach to overcoming antiviral resistance. J Med Chem51:4839-43 (2008) 
 
Protease
Name:Protease
Synonyms:n/a
Type:Enzyme
Mol. Mass.:10904.79
Organism:Human immunodeficiency virus 1 (HIV-1)
Description:Q9YQ12
Residue:99
BDBM50067593
NameBDBM50067593
TypeSmall organic molecule
Emp. Form.C36H47N5O4
Mol. Mass.613.7895
SMILESCC(C)(C)NC(=O)[C@@H]1CN(Cc2cccnc2)CCN1C[C@@H](O)C[C@@H](Cc1ccccc1)C(=O)N[C@@H]1[C@H](O)Cc2ccccc12