Reaction Details
TargetDihydrofolate reductase
LigandBDBM18050
Substrate/Competitorn/a
Meas. Tech.ChEBML_54451
IC50 50±n/a nM
Citation Rosowsky, AForsch, RAFreisheim, JHGalivan, JWick, M Methotrexate analogues. 23. Synthesis, dihydrofolate reductase affinity, cytotoxicity, and in vivo antitumor activity of some putative degradation products of methotrexate-poly(L-lysine) conjugates. J Med Chem27:888-93 (1984) Dihydrofolate reductase
Name:Dihydrofolate reductase
Type:Enzyme
Mol. Mass.:21608.82
Organism:Mus musculus (Mouse)
Description:n/a
Residue:187
BDBM18050
NameBDBM18050
Synonyms:2-[(4-{[(2,4-diaminopteridin-6-yl)methyl](methyl)amino}phenyl)formamido]pentanedioic acid MTX cid_126941
TypeSmall organic molecule
Emp. Form.C20H22N8O5
Mol. Mass.454.4393
SMILESCN(Cc1cnc2nc(N)nc(N)c2n1)c1ccc(cc1)C(=O)N[C@@H](CCC(O)=O)C(O)=O