Reaction Details
TargetPepsin A
LigandBDBM50025525
Substrate/Competitorn/a
Meas. Tech.ChEBML_154018
Ki 0.310000±n/a nM
Citation Rich, DHBernatowicz, MS Synthesis of analogues of the carboxyl protease inhibitor pepstatin. Effect of structure in subsite P3 on inhibition of pepsin. J Med Chem25:791-5 (1982) Pepsin A
Name:Pepsin A
Type:Enzyme
Mol. Mass.:41232.87
Organism:Porcine
Description:n/a
Residue:385
BDBM50025525
NameBDBM50025525
Synonyms:4-[2-(2-Ethyl-butyrylamino)-3-methyl-butyrylamino]-3-hydroxy-6-methyl-heptanoic acid [1-(3-methyl-butylcarbamoyl)-ethyl]-amide CHEMBL262137
TypeSmall organic molecule
Emp. Form.C26H50N4O5
Mol. Mass.498.699
SMILESCCC(C)C(=O)N[C@@H](C(C)C)C(=O)N[C@@H](CC(C)C)[C@@H](O)CC(=O)N[C@@H](C)C(=O)NCCC(C)C