Reaction Details
TargetHistamine H1 receptor
LigandBDBM50017656
Substrate/Competitorn/a
Meas. Tech.ChEMBL_535792 (CHEMBL991557)
EC50 28200±n/a nM
Citation Farag, NAMohamed, SRSoliman, GA Design, synthesis, and docking studies of novel benzopyrone derivatives as H(1)-antihistaminic agents. Bioorg Med Chem16:9009-17 (2008) 
 
Histamine H1 receptor
Name:Histamine H1 receptor
Type:G Protein-Coupled Receptor (GPCR)
Mol. Mass.:55641.53
Organism:Cavia porcellus (domestic guinea pig)
Description:Guinea pig cerebellum was used in binding assay.
Residue:488
BDBM50017656
NameBDBM50017656
Synonyms:CHEMBL1193 Naphcon-A PHENIRAMINE | Visine-A
TypeSmall organic molecule
Emp. Form.C16H20N2
Mol. Mass.240.3434
SMILESCN(C)CCC(c1ccccc1)c1ccccn1