Reaction Details
TargetVoltage-dependent L-type calcium channel subunit alpha-1S
LigandBDBM50479455
Substrate/Competitorn/a
Meas. Tech.ChEMBL_512033 (CHEMBL970836)
Ki 450±n/a nM
Citation Carosati, EBudriesi, RIoan, PUgenti, MPFrosini, MFusi, FCorda, GCosimelli, BSpinelli, DChiarini, ACruciani, G Discovery of novel and cardioselective diltiazem-like calcium channel blockers via virtual screening. J Med Chem51:5552-65 (2008) 
 
Voltage-dependent L-type calcium channel subunit alpha-1S
Name:Voltage-dependent L-type calcium channel subunit alpha-1S
Type:PROTEIN
Mol. Mass.:210392.58
Organism:Rattus norvegicus
Description:ChEMBL_92777
Residue:1850
BDBM50479455
NameBDBM50479455
Synonyms:CHEMBL492668
TypeSmall organic molecule
Emp. Form.C15H18N2O2
Mol. Mass.258.3156
SMILESCN(C)CCNC(=O)c1cc2ccccc2cc1O