Reaction Details
TargetProtease
LigandBDBM8125
Substrate/Competitorn/a
Meas. Tech.ChEMBL_538756 (CHEMBL1024875)
Ki 22±n/a nM
Citation Kovalevsky, AYGhosh, AKWeber, IT Solution kinetics measurements suggest HIV-1 protease has two binding sites for darunavir and amprenavir. J Med Chem51:6599-603 (2008) 
 
Protease
Name:Protease
Synonyms:n/a
Type:Enzyme
Mol. Mass.:10904.79
Organism:Human immunodeficiency virus 1 (HIV-1)
Description:Q9YQ12
Residue:99
BDBM8125
NameBDBM8125
TypeSmall organic molecule
Emp. Form.C27H37N3O7S
Mol. Mass.547.664
SMILES[H][C@@]1(CO[C@@]2([H])OCC[C@@]12[H])OC(=O)N[C@@H](Cc1ccccc1)[C@H](O)CN(CC(C)C)S(=O)(=O)c1ccc(N)cc1