Reaction Details
TargetProstaglandin G/H synthase 1
LigandBDBM246485
Substrate/Competitorn/a
Meas. Tech.ChEMBL_562800 (CHEMBL1018880)
IC50 18000±n/a nM
Citation Yang, MHYoon, KDChin, YWPark, JHKim, J Phenolic compounds with radical scavenging and cyclooxygenase-2 (COX-2) inhibitory activities from Dioscorea opposita. Bioorg Med Chem17:2689-94 (2009) 
 
Prostaglandin G/H synthase 1
Name:Prostaglandin G/H synthase 1
Type:Protein
Mol. Mass.:68868.60
Organism:Ovis aries (Sheep)
Description:n/a
Residue:600
BDBM246485
NameBDBM246485
Synonyms:Tristin (1)
TypeSmall organic molecule
Emp. Form.C15H16O4
Mol. Mass.260.2851
SMILESCOc1cc(CCc2cc(O)cc(O)c2)ccc1O