Reaction Details
TargetReverse transcriptase
LigandBDBM1732
Substrate/Competitorn/a
Meas. Tech.ChEMBL_545024 (CHEMBL1016320)
IC50 2697739±n/a nM
Citation Hu, RDoucet, JPDelamar, MZhang, R QSAR models for 2-amino-6-arylsulfonylbenzonitriles and congeners HIV-1 reverse transcriptase inhibitors based on linear and nonlinear regression methods. Eur J Med Chem44:2158-71 (2009) 
 
Reverse transcriptase
Name:Reverse transcriptase
Synonyms:n/a
Type:Protein
Mol. Mass.:29598.37
Organism:Human immunodeficiency virus 1
Description:Q9WKE8
Residue:254
BDBM1732
NameBDBM1732
TypeSmall organic molecule
Emp. Form.C14H12N2OS
Mol. Mass.256.323
SMILESCOc1ccccc1Sc1cccc(N)c1C#N