Reaction Details
TargetDihydrofolate reductase
LigandBDBM50028534
Substrate/Competitorn/a
Meas. Tech.ChEBML_54593
Ki 170±n/a nM
Citation Piper, JRMontgomery, JASirotnak, FMChello, PL Syntheses of alpha- and gamma-substituted amides, peptides, and esters of methotrexate and their evaluation as inhibitors of folate metabolism. J Med Chem25:182-7 (1982) Dihydrofolate reductase
Name:Dihydrofolate reductase
Type:Enzyme
Mol. Mass.:21608.82
Organism:Mus musculus (Mouse)
Description:n/a
Residue:187
BDBM50028534
NameBDBM50028534
Synonyms:CHEMBL298807 | derivative of methotrexate
TypeSmall organic molecule
Emp. Form.C25H29N9O8
Mol. Mass.583.5533
SMILESCN(Cc1cnc2nc(N)nc(N)c2n1)c1ccc(cc1)C(=O)NC(CCC(O)=O)C(=O)N[C@@H](CCC(O)=O)C(O)=O