Reaction Details
TargetDihydrofolate reductase
LigandBDBM50028541
Substrate/Competitorn/a
Meas. Tech.ChEBML_54593
Ki 0.003500±n/a nM
Citation Piper, JRMontgomery, JASirotnak, FMChello, PL Syntheses of alpha- and gamma-substituted amides, peptides, and esters of methotrexate and their evaluation as inhibitors of folate metabolism. J Med Chem25:182-7 (1982) Dihydrofolate reductase
Name:Dihydrofolate reductase
Type:Enzyme
Mol. Mass.:21608.82
Organism:Mus musculus (Mouse)
Description:n/a
Residue:187
BDBM50028541
NameBDBM50028541
Synonyms:2-{4-[(2,4-Diamino-pteridin-6-ylmethyl)-methyl-amino]-benzoylamino}-4-pentylcarbamoyl-butyric acid | CHEMBL55775
TypeSmall organic molecule
Emp. Form.C25H33N9O4
Mol. Mass.523.5874
SMILESCCCCCNC(=O)CCC(NC(=O)c1ccc(cc1)N(C)Cc1cnc2nc(N)nc(N)c2n1)C(O)=O