Reaction Details
TargetCystic fibrosis transmembrane conductance regulator
LigandBDBM50482139
Substrate/Competitorn/a
Meas. Tech.ChEMBL_632278 (CHEMBL1110140)
EC50 1000±n/a nM
Citation Ye, LKnapp, JMSangwung, PFettinger, JCVerkman, ASKurth, MJ Pyrazolylthiazole as DeltaF508-cystic fibrosis transmembrane conductance regulator correctors with improved hydrophilicity compared to bithiazoles. J Med Chem53:3772-81 (2010) 
 
Cystic fibrosis transmembrane conductance regulator
Name:Cystic fibrosis transmembrane conductance regulator
Type:Enzyme Catalytic Domain
Mol. Mass.:168171.30
Organism:Homo sapiens (Human)
Description:gi_90421313
Residue:1480
BDBM50482139
NameBDBM50482139
Synonyms:CHEMBL1098499
TypeSmall organic molecule
Emp. Form.C28H30ClN5O4S
Mol. Mass.568.087
SMILESCOc1ccc(NC(=O)c2cc(-c3sc(NC(=O)C(C)(C)C)nc3C)n(Cc3cc(Cl)ccc3OC)n2)cc1