Reaction Details
TargetPenicillin-binding protein 1A
LigandBDBM50482776
Substrate/Competitorn/a
Meas. Tech.ChEMBL_672069 (CHEMBL1267450)
IC50 365±n/a nM
Citation Kosowska-Shick, KMcGhee, PLAppelbaum, PC Affinity of ceftaroline and other beta-lactams for penicillin-binding proteins from Staphylococcus aureus and Streptococcus pneumoniae. Antimicrob Agents Chemother54:1670-7 (2010) 
 
Penicillin-binding protein 1A
Name:Penicillin-binding protein 1A
Type:PROTEIN
Mol. Mass.:79749.99
Organism:Streptococcus pneumoniae serotype 4 (strain ATCC BAA-334 / TIGR4)
Description:ChEMBL_103552
Residue:719
BDBM50482776
NameBDBM50482776
Synonyms:CHEBI:70718 PPI-0903 | TAK-599
TypeSmall organic molecule
Emp. Form.C22H21N8O8PS4
Mol. Mass.684.685
SMILES[H][C@]12SCC(Sc3nc(cs3)-c3cc[n+](C)cc3)=C(N1C(=O)[C@H]2NC(=O)C(=N/OCC)\c1nsc(NP(O)(O)=O)n1)C([O-])=O