Reaction Details
TargetPenicillin-binding protein 1A
LigandBDBM50482777
Substrate/Competitorn/a
Meas. Tech.ChEMBL_672067 (CHEMBL1267448)
IC50 219±n/a nM
Citation Kosowska-Shick, KMcGhee, PLAppelbaum, PC Affinity of ceftaroline and other beta-lactams for penicillin-binding proteins from Staphylococcus aureus and Streptococcus pneumoniae. Antimicrob Agents Chemother54:1670-7 (2010) 
 
Penicillin-binding protein 1A
Name:Penicillin-binding protein 1A
Type:PROTEIN
Mol. Mass.:79749.99
Organism:Streptococcus pneumoniae serotype 4 (strain ATCC BAA-334 / TIGR4)
Description:ChEMBL_103552
Residue:719
BDBM50482777
NameBDBM50482777
Synonyms:CHEBI:204928 | Cefotaxime
TypeSmall organic molecule
Emp. Form.C16H17N5O7S2
Mol. Mass.455.465
SMILES[H][C@]12SCC(COC(C)=O)=C(N1C(=O)[C@H]2NC(=O)C(=N/OC)\c1csc(N)n1)C(O)=O