Reaction Details
TargetPenicillin-binding protein 1A
LigandBDBM50103601
Substrate/Competitorn/a
Meas. Tech.ChEMBL_672067 (CHEMBL1267448)
IC50 180±n/a nM
Citation Kosowska-Shick, KMcGhee, PLAppelbaum, PC Affinity of ceftaroline and other beta-lactams for penicillin-binding proteins from Staphylococcus aureus and Streptococcus pneumoniae. Antimicrob Agents Chemother54:1670-7 (2010) 
 
Penicillin-binding protein 1A
Name:Penicillin-binding protein 1A
Type:PROTEIN
Mol. Mass.:79749.99
Organism:Streptococcus pneumoniae serotype 4 (strain ATCC BAA-334 / TIGR4)
Description:ChEMBL_103552
Residue:719
BDBM50103601
NameBDBM50103601
Synonyms:CHEBI:29007 | Ceftriaxone
TypeSmall organic molecule
Emp. Form.C18H18N8O7S3
Mol. Mass.554.58
SMILES[H][C@@]1(NC(=O)C(=N/OC)\c2csc(N)n2)C(=O)N2C(C(O)=O)=C(CSc3nc(=O)c(O)nn3C)CS[C@]12[H]