Reaction Details
TargetReverse transcriptase
LigandBDBM50002692
Substrate/Competitorn/a
Meas. Tech.ChEMBL_699570 (CHEMBL1647928)
IC50 21430±n/a nM
Citation Chen, HZhao, JLi, YShen, FLi, XYin, QQin, ZYan, XWang, YZhang, PZhang, J Synthesis and biological activity of novel 5'-arylamino-nucleosides by microwave-assisted one-pot tandem Staudinger/aza-Wittig/reduction. Bioorg Med Chem Lett21:574-6 (2011) 
 
Reverse transcriptase
Name:Reverse transcriptase
Synonyms:n/a
Type:Protein
Mol. Mass.:29598.37
Organism:Human immunodeficiency virus 1
Description:Q9WKE8
Residue:254
BDBM50002692
NameBDBM50002692
TypeSmall organic molecule
Emp. Form.C10H13N5O4
Mol. Mass.267.2413
SMILESCc1cn([C@H]2C[C@H](N=[N+]=[N-])[C@@H](CO)O2)c(=O)[nH]c1=O