Reaction Details
TargetPenicillin-binding protein 1A
LigandBDBM50213266
Substrate/Competitorn/a
Meas. Tech.ChEMBL_706008 (CHEMBL1662822)
IC50 173±n/a nM
Citation Kosowska-Shick, KMcGhee, PAppelbaum, PC Binding of faropenem and other beta-lactam agents to penicillin-binding proteins of pneumococci with various beta-lactam susceptibilities. Antimicrob Agents Chemother53:2176-80 (2009) 
 
Penicillin-binding protein 1A
Name:Penicillin-binding protein 1A
Type:PROTEIN
Mol. Mass.:79749.99
Organism:Streptococcus pneumoniae serotype 4 (strain ATCC BAA-334 / TIGR4)
Description:ChEMBL_103552
Residue:719
BDBM50213266
NameBDBM50213266
Synonyms:CHEBI:471744 MK-0787
TypeSmall organic molecule
Emp. Form.C12H17N3O4S
Mol. Mass.299.346
SMILES[H][C@]12CC(SCCNC=N)=C(N1C(=O)[C@]2([H])[C@@H](C)O)C(O)=O