Reaction Details
TargetPenicillin-binding protein 1A
LigandBDBM50422689
Substrate/Competitorn/a
Meas. Tech.ChEMBL_706001 (CHEMBL1662815)
IC50 2.36±n/a nM
Citation Kosowska-Shick, KMcGhee, PAppelbaum, PC Binding of faropenem and other beta-lactam agents to penicillin-binding proteins of pneumococci with various beta-lactam susceptibilities. Antimicrob Agents Chemother53:2176-80 (2009) 
 
Penicillin-binding protein 1A
Name:Penicillin-binding protein 1A
Type:PROTEIN
Mol. Mass.:79749.99
Organism:Streptococcus pneumoniae serotype 4 (strain ATCC BAA-334 / TIGR4)
Description:ChEMBL_103552
Residue:719
BDBM50422689
NameBDBM50422689
Synonyms:640/359 | CEFUROXIME
TypeSmall organic molecule
Emp. Form.C16H16N4O8S
Mol. Mass.424.385
SMILESCO\N=C(/C(=O)N[C@H]1[C@H]2SCC(COC(N)=O)=C(N2C1=O)C(O)=O)c1ccco1