Reaction Details
TargetPenicillin-binding protein 1A
LigandBDBM50350464
Substrate/Competitorn/a
Meas. Tech.ChEMBL_706001 (CHEMBL1662815)
IC50 339±n/a nM
Citation Kosowska-Shick, KMcGhee, PAppelbaum, PC Binding of faropenem and other beta-lactam agents to penicillin-binding proteins of pneumococci with various beta-lactam susceptibilities. Antimicrob Agents Chemother53:2176-80 (2009) 
 
Penicillin-binding protein 1A
Name:Penicillin-binding protein 1A
Type:PROTEIN
Mol. Mass.:79749.99
Organism:Streptococcus pneumoniae serotype 4 (strain ATCC BAA-334 / TIGR4)
Description:ChEMBL_103552
Residue:719
BDBM50350464
NameBDBM50350464
Synonyms:AMOXICILLINE Amoxi-Tabs | Amoxicillin
TypeSmall organic molecule
Emp. Form.C16H19N3O5S
Mol. Mass.365.404
SMILESCC1(C)S[C@@H]2[C@H](NC(=O)[C@H](N)c3ccc(O)cc3)C(=O)N2[C@H]1C(O)=O