Reaction Details
TargetPenicillin-binding protein 1A
LigandBDBM50483324
Substrate/Competitorn/a
Meas. Tech.ChEMBL_706006 (CHEMBL1662820)
IC50 35.0±n/a nM
Citation Kosowska-Shick, KMcGhee, PAppelbaum, PC Binding of faropenem and other beta-lactam agents to penicillin-binding proteins of pneumococci with various beta-lactam susceptibilities. Antimicrob Agents Chemother53:2176-80 (2009) 
 
Penicillin-binding protein 1A
Name:Penicillin-binding protein 1A
Type:PROTEIN
Mol. Mass.:79749.99
Organism:Streptococcus pneumoniae serotype 4 (strain ATCC BAA-334 / TIGR4)
Description:ChEMBL_103552
Residue:719
BDBM50483324
NameBDBM50483324
Synonyms:CHEBI:51257 | Faropenem
TypeSmall organic molecule
Emp. Form.C12H15NO5S
Mol. Mass.285.316
SMILES[H][C@]12SC(=C(N1C(=O)[C@]2([H])[C@@H](C)O)C(O)=O)[C@@]1([H])CCCO1