Reaction Details
TargetProtease
LigandBDBM50067593
Substrate/Competitorn/a
Meas. Tech.ChEMBL_830319 (CHEMBL2060908)
Kd 1.2±n/a nM
Citation Domínguez, JLGossas, TCarmen Villaverde, MHelena Danielson, USussman, F Experimental and 'in silico' analysis of the effect of pH on HIV-1 protease inhibitor affinity: implications for the charge state of the protein ionogenic groups. Bioorg Med Chem20:4838-47 (2012) 
 
Protease
Name:Protease
Synonyms:n/a
Type:Enzyme
Mol. Mass.:10904.79
Organism:Human immunodeficiency virus 1 (HIV-1)
Description:Q9YQ12
Residue:99
BDBM50067593
NameBDBM50067593
TypeSmall organic molecule
Emp. Form.C36H47N5O4
Mol. Mass.613.7895
SMILESCC(C)(C)NC(=O)[C@@H]1CN(Cc2cccnc2)CCN1C[C@@H](O)C[C@@H](Cc1ccccc1)C(=O)N[C@@H]1[C@H](O)Cc2ccccc12