Reaction Details
TargetATP-dependent translocase ABCB1
LigandBDBM50453799
Substrate/Competitorn/a
Meas. Tech.ChEMBL_829666 (CHEMBL2061056)
IC50 708±n/a nM
Citation Jabeen, IPleban, KRinner, UChiba, PEcker, GF Structure-activity relationships, ligand efficiency, and lipophilic efficiency profiles of benzophenone-type inhibitors of the multidrug transporter P-glycoprotein. J Med Chem55:3261-73 (2012) 
 
ATP-dependent translocase ABCB1
Name:ATP-dependent translocase ABCB1
Type:Protein
Mol. Mass.:141503.50
Organism:Homo sapiens (Human)
Description:P08183
Residue:1280
BDBM50453799
NameBDBM50453799
Synonyms:Niguldipine
TypeSmall organic molecule
Emp. Form.C36H39N3O6
Mol. Mass.609.7114
SMILESCOC(=O)C1=C(C)NC(C)=C([C@H]1c1cccc(c1)[N+]([O-])=O)C(=O)OCCCN1CCC(CC1)(c1ccccc1)c1ccccc1