Reaction Details
TargetSolute carrier family 15 member 2
LigandBDBM23971
Substrate/Competitorn/a
Meas. Tech.ChEMBL_838263 (CHEMBL2076211)
Ki 18000±n/a nM
Citation Terada, TSawada, KIrie, MSaito, HHashimoto, YInui, K Structural requirements for determining the substrate affinity of peptide transporters PEPT1 and PEPT2. Pflugers Arch440:679-84 (2000) 
 
Solute carrier family 15 member 2
Name:Solute carrier family 15 member 2
Type:PROTEIN
Mol. Mass.:81331.63
Organism:Rattus norvegicus
Description:ChEMBL_838253
Residue:729
BDBM23971
NameBDBM23971
Synonyms:(2S)-2-[(2S,3R)-3-amino-2-hydroxy-4-phenylbutanamido]-4-methylpentanoic acid CHEMBL29292 | Ubenimex
TypeSmall organic molecule
Emp. Form.C16H24N2O4
Mol. Mass.308.3728
SMILESCC(C)C[C@H](NC(=O)[C@@H](O)[C@H](N)Cc1ccccc1)C(O)=O