Reaction Details
TargetSolute carrier family 22 member 2
LigandBDBM50420217
Substrate/Competitorn/a
Meas. Tech.ChEMBL_838310 (CHEMBL2076808)
Ki 570000±n/a nM
Citation Gorboulev, VUlzheimer, JCAkhoundova, AUlzheimer-Teuber, IKarbach, UQuester, SBaumann, CLang, FBusch, AEKoepsell, H Cloning and characterization of two human polyspecific organic cation transporters. DNA Cell Biol16:871-81 (1997) 
 
Solute carrier family 22 member 2
Name:Solute carrier family 22 member 2
Type:PROTEIN
Mol. Mass.:62591.01
Organism:Homo sapiens (Human)
Description:ChEMBL_1484077
Residue:555
BDBM50420217
NameBDBM50420217
Synonyms:METIPRENALINE
TypeSmall organic molecule
Emp. Form.C12H19NO3
Mol. Mass.225.2842
SMILESCOc1cc(ccc1O)C(O)CNC(C)C