Reaction Details
TargetATP-binding cassette sub-family C member 2
LigandBDBM50028605
Substrate/Competitorn/a
Meas. Tech.ChEMBL_838268 (CHEMBL2076216)
Ki 154000±n/a nM
Citation Han, YHKato, YHaramura, MOhta, MMatsuoka, HSugiyama, Y Physicochemical parameters responsible for the affinity of methotrexate analogs for rat canalicular multispecific organic anion transporter (cMOAT/MRP2). Pharm Res18:579-86 (2001) 
 
ATP-binding cassette sub-family C member 2
Name:ATP-binding cassette sub-family C member 2
Type:PROTEIN
Mol. Mass.:173415.22
Organism:Rattus norvegicus
Description:ChEMBL_1455464
Residue:1541
BDBM50028605
NameBDBM50028605
Synonyms:2-{4-[(2,4-Diamino-pteridin-6-ylmethyl)-propyl-amino]-benzoylamino}-pentanedioic acid | CHEMBL354055
TypeSmall organic molecule
Emp. Form.C22H26N8O5
Mol. Mass.482.4924
SMILESCCCN(Cc1cnc2nc(N)nc(N)c2n1)c1ccc(cc1)C(=O)NC(CCC(O)=O)C(O)=O