Reaction Details
TargetBile salt export pump
LigandBDBM50061101
Substrate/Competitorn/a
Meas. Tech.ChEMBL_837472 (CHEMBL2075960)
Ki 12000±n/a nM
Citation Fattinger, KFunk, CPantze, MWeber, CReichen, JStieger, BMeier, PJ The endothelin antagonist bosentan inhibits the canalicular bile salt export pump: a potential mechanism for hepatic adverse reactions. Clin Pharmacol Ther69:223-31 (2001) 
 
Bile salt export pump
Name:Bile salt export pump
Type:PROTEIN
Mol. Mass.:146267.86
Organism:Rattus norvegicus
Description:ChEMBL_1481883
Residue:1321
BDBM50061101
NameBDBM50061101
Synonyms:4-(1,1-Dimethylethyl)-N-(6-(2-hydroxyethoxy)-5-(2-methoxyphenoxy)-(2,2'-bipyrimidin)-4-yl) benzenesulfornamide BOSENTAN p-tert-Butyl-N-(6-(2-hydroxyethoxy)-5-(o-methoxyphenoxy)-2-(2-pyrimidinyl)-4-pyrimidinyl)benzenesulfonamide
TypeSmall organic molecule
Emp. Form.C27H29N5O6S
Mol. Mass.551.614
SMILESCOc1ccccc1Oc1c(NS(=O)(=O)c2ccc(cc2)C(C)(C)C)nc(nc1OCCO)-c1ncccn1