Reaction Details
TargetBile salt export pump
LigandBDBM50485604
Substrate/Competitorn/a
Meas. Tech.ChEMBL_837472 (CHEMBL2075960)
Ki 8500±n/a nM
Citation Fattinger, KFunk, CPantze, MWeber, CReichen, JStieger, BMeier, PJ The endothelin antagonist bosentan inhibits the canalicular bile salt export pump: a potential mechanism for hepatic adverse reactions. Clin Pharmacol Ther69:223-31 (2001) 
 
Bile salt export pump
Name:Bile salt export pump
Type:PROTEIN
Mol. Mass.:146267.86
Organism:Rattus norvegicus
Description:ChEMBL_1481883
Residue:1321
BDBM50485604
NameBDBM50485604
Synonyms:BOSENTAN M2
TypeSmall organic molecule
Emp. Form.C27H29N5O5S
Mol. Mass.535.615
SMILESCC(C)(C)c1ccc(cc1)S(=O)(=O)Nc1nc(nc(OCCO)c1Cc1ccccc1O)-c1ncccn1