Reaction Details
TargetSolute carrier organic anion transporter family member 1A1
LigandBDBM50375594
Substrate/Competitorn/a
Meas. Tech.ChEMBL_837108 (CHEMBL2076360)
Ki 32000±n/a nM
Citation Pang, KSWang, PJChung, AYWolkoff, AW The modified dipeptide, enalapril, an angiotensin-converting enzyme inhibitor, is transported by the rat liver organic anion transport protein. Hepatology28:1341-6 (1998) 
 
Solute carrier organic anion transporter family member 1A1
Name:Solute carrier organic anion transporter family member 1A1
Type:PROTEIN
Mol. Mass.:74188.94
Organism:Rattus norvegicus
Description:ChEMBL_838286
Residue:670
BDBM50375594
NameBDBM50375594
Synonyms:TAUROCHOLATE
TypeSmall organic molecule
Emp. Form.C26H45NO7S
Mol. Mass.515.703
SMILESC[C@H](CCC(=O)NCCS(O)(=O)=O)[C@H]1CC[C@H]2[C@@H]3[C@H](O)C[C@@H]4C[C@H](O)CC[C@]4(C)[C@H]3C[C@H](O)[C@]12C