Reaction Details
TargetATP-dependent translocase ABCB1
LigandBDBM50101815
Substrate/Competitorn/a
Meas. Tech.ChEMBL_838474 (CHEMBL2076045)
IC50 4540±n/a nM
Citation Takara, KSakaeda, TTanigawara, YNishiguchi, KOhmoto, NHorinouchi, MKomada, FOhnishi, NYokoyama, TOkumura, K Effects of 12 Ca2+ antagonists on multidrug resistance, MDR1-mediated transport and MDR1 mRNA expression. Eur J Pharm Sci16:159-65 (2002) 
 
ATP-dependent translocase ABCB1
Name:ATP-dependent translocase ABCB1
Type:Protein
Mol. Mass.:141503.50
Organism:Homo sapiens (Human)
Description:P08183
Residue:1280
BDBM50101815
NameBDBM50101815
Synonyms:CHEBI:7550 | Nicardipine
TypeSmall organic molecule
Emp. Form.C26H29N3O6
Mol. Mass.479.525
SMILESCOC(=O)C1=C(C)NC(C)=C(C1c1cccc(c1)[N+]([O-])=O)C(=O)OCCN(C)Cc1ccccc1