Reaction Details
TargetAdenosine deaminase
LigandBDBM50240434
Substrate/Competitorn/a
Meas. Tech.ChEBML_30810
pH7±n/a
Ki 4000±n/a nM
Commentsextracted
Citation Grant, AJLerner, LM Heat-induced formation of alpha,beta-unsaturated nucleoside dialdehydes and their activity with adenosine deaminase. J Med Chem23:795-8 (1980) Adenosine deaminase
Name:Adenosine deaminase
Type:Enzyme
Mol. Mass.:40910.44
Organism:Bos taurus (bovine)
Description:n/a
Residue:363
BDBM50240434
NameBDBM50240434
Synonyms:2-[1-(6-Amino-purin-9-yl)-2-oxo-ethoxy]-propenal | CHEMBL280595
TypeSmall organic molecule
Emp. Form.C10H9N5O3
Mol. Mass.247.2102
SMILESNc1ncnc2n(cnc12)C(OC(=C)C=O)C=O